Patient ID,PLE,Onset of PLE post Fontan,Heterotaxy,Type of single ventricle,Age at Fontan (years),Duration of follow up (years) From date of Fontan until last discharge/last CERNER note,"Status at last follow up  death 1, alive: 2 or transplant: 3,  HOSPICE, HOME : 4",ETHNIC ORIGIN,Gender,type of fontan ,Fenestration performed,Number of encounterss,Hospital LOS,CICU LOS,Albumin-25% infusion,Any ACE inhibitor,Enalapril,Captopril,Calcium,Any PAH medication,Tadalafil,Sildenfil,Budesonide,Ambrisentan,Bosentan,Any anticoagulant,Asprin,Clopidogril (Pla,Heparin,Warfarin,Digoxin,Any diuretic,Furosomide,Spironolactone,Hyrdonlorothiazi,Hydrochl..spiron,Any drip,Dubutamine,Dopamine,Norepinephrine,Epinephrine,Vasopresson,Milrinone,Carvedilol,TOTAL Chrgs,Estimated total cost,OPERATING Costs
,"0:No,1:yes",years,"1:yes, 0: No","1- Hypoplastic left heart with aortic and mitral atresia, 2- Hypoplastic left heart with aortic atresia and mitral stenosis, 3- Hypoplastic left heart with aortic hypoplasia and mitral atresia 4- Hypoplastic left heart with aortic and mitral hypoplasia, 5- Double inlet left ventricle, 6- Double outlet right ventricle, 7- Unbalanced AV canal, 8- Double outlet right ventricle with left-sided hypoplasia 9 - Tricuspid atresia 10- Pulmonary atresia 11-others",years,years,"death 1, alive: 2 or transplant: 3,  HOSPICE, HOME : 4","3: Black, 4: Caucasian, 5: others","Male:0, Female:1","1: Intra/extra cardiac fontan, 2: Extra cardiac fontan, 3: Lateral fontan, 4: Others","1:yes, 0: No",,,,,,,,,,,,,,,,,,,,,,,,,,,,,,,,,,2018 US dollar,Ratio-cost-to-charge  ,2018 US dollar
1,1,0.339726027,0,5,15.44383562,2.821917808,2,3,1,1,1,26,2,0,0,0,0,0,0,0,0,0,0,0,0,1,1,0,0,0,1,1,1,0,0,0,0,0,0,0,0,0,0,0,16379,5425.625645,2950.888
1,,,,,,,,,,,,,3,0,1,0,0,0,0,0,0,0,0,0,0,1,1,0,0,0,1,1,1,1,0,0,0,0,0,0,0,0,0,0,33760,11183.1688,5859.256
1,,,,,,,,,,,,,0,0,0,0,0,0,0,0,0,0,0,0,0,0,0,0,0,0,0,0,0,0,0,0,0,0,0,0,0,0,0,0,3585,1091.56797,363.3
1,,,,,,,,,,,,,2,0,1,0,0,0,0,0,0,0,0,0,0,1,1,0,0,0,1,1,1,1,0,0,0,0,0,0,0,0,0,0,15382,4683.542124,2811.9
1,,,,,,,,,,,,,6,0,1,0,0,0,0,1,1,0,0,0,0,1,1,0,1,0,1,1,1,1,0,0,0,0,0,0,0,0,0,0,81718,24881.66008,19503.75
1,,,,,,,,,,,,,0,0,0,0,0,0,0,0,0,0,0,0,0,0,0,0,0,0,0,0,0,0,0,0,0,0,0,0,0,0,0,0,2394,728.929908,305.55
1,,,,,,,,,,,,,2,0,1,0,0,0,0,1,1,0,0,0,0,1,1,0,0,0,1,1,1,1,0,0,0,0,0,0,0,0,0,0,19406,5908.777692,3505.95
1,,,,,,,,,,,,,3,0,1,0,0,0,0,1,1,0,0,0,0,1,1,0,0,0,1,1,1,1,0,0,0,0,0,0,0,0,0,0,30055,9151.20651,5687.85
1,,,,,,,,,,,,,3,0,1,0,0,0,0,1,1,0,0,0,0,1,1,0,0,0,1,1,1,1,0,0,0,0,0,0,0,0,0,0,27092,8249.026344,5408.55
1,,,,,,,,,,,,,3,0,1,0,0,0,0,1,1,0,0,0,0,1,1,0,0,0,1,1,1,1,0,0,0,0,0,0,0,0,0,0,27154,8267.904228,5314.05
1,,,,,,,,,,,,,1,0,1,0,0,0,0,1,1,0,1,0,0,1,1,0,0,0,1,1,1,1,0,0,0,0,0,0,0,0,0,0,13093,3986.582826,2324.7
1,,,,,,,,,,,,,1,0,1,0,0,0,0,1,1,0,1,0,0,1,1,0,0,0,1,1,1,1,0,0,0,0,0,0,0,0,0,0,16146,4916.166372,3608.85
1,,,,,,,,,,,,,7,0,1,0,0,0,0,1,1,0,1,0,0,1,1,0,1,0,1,1,1,1,0,0,1,0,0,0,1,0,0,0,91295,27576.5677,20634.016
1,,,,,,,,,,,,,2,0,1,0,0,0,0,1,1,0,1,0,0,1,1,0,0,0,1,1,1,1,0,0,0,0,0,0,0,0,0,0,139629,42176.33574,3018.208
1,,,,,,,,,,,,,2,0,1,0,0,0,0,1,1,0,1,0,0,1,1,0,0,0,1,1,1,1,0,0,1,0,0,0,1,0,0,0,33806,10211.44036,7278.24
1,,,,,,,,,,,,,2,0,1,0,0,0,0,1,1,0,1,0,0,1,1,0,0,0,1,1,1,1,0,0,0,0,0,0,0,0,0,0,20796.44,6281.772666,3982.472
1,,,,,,,,,,,,,1,0,1,0,0,0,0,1,1,0,1,0,0,1,1,0,0,0,1,1,1,1,0,0,0,0,0,0,0,0,0,0,11552.664,3489.597688,2314.028
1,,,,,,,,,,,,,5,0,1,0,0,0,0,1,1,0,1,0,0,1,1,0,0,0,1,1,1,1,0,0,0,0,0,0,0,0,0,0,50205.464,15165.06246,10389.996
1,,,,,,,,,,,,,6,0,1,0,0,0,0,1,1,0,1,0,0,1,1,0,0,0,1,1,1,1,0,0,0,0,0,0,0,0,0,0,67025.6,20245.75274,14577.04
1,,,,,,,,,,,,,5,0,1,0,0,0,0,1,1,0,1,0,0,1,1,0,0,0,1,1,1,1,0,0,0,0,0,0,0,0,0,0,62265.96,18808.05588,13312.6
1,,,,,,,,,,,,,4,0,1,0,0,0,0,1,1,0,1,0,0,1,1,0,0,0,1,1,1,1,0,0,0,0,0,0,0,0,0,0,59892.308,18091.07055,12355.532
1,,,,,,,,,,,,,46,8,1,0,0,0,1,1,1,0,1,0,0,1,1,0,1,0,1,1,1,1,0,0,1,0,1,0,1,1,1,0,889778.204,268766.4043,275415.592
1,,,,,,,,,,,,,2,0,1,0,0,0,0,1,1,0,1,0,0,0,0,0,0,0,0,1,1,0,0,0,0,0,0,0,0,0,0,0,23114.58,6981.990035,4117.14
1,,,,,,,,,,,,,2,0,0,0,0,0,0,1,1,0,1,0,0,1,0,0,1,0,0,0,0,0,0,0,0,0,0,0,0,0,0,0,33139.636,10010.15845,6869.096
1,,,,,,,,,,,,,1,0,1,0,0,0,0,1,1,0,1,0,0,0,0,0,0,0,0,1,1,0,0,0,0,0,0,0,0,0,0,0,20394.492,6160.360254,3704.912
1,,,,,,,,,,,,,12,1,0,0,0,0,0,1,1,0,1,0,0,1,0,0,1,0,0,1,1,0,0,0,1,0,0,0,1,0,0,0,145229.672,43868.07472,28237.104
2,1,12.55890411,0,11,3.101369863,14.93972603,2,3,1,2,1,15,2,1,0,1,1,0,0,0,0,0,0,0,0,1,1,0,0,0,1,1,0,1,0,0,0,0,0,0,0,0,0,0,29452.04,11168.6259,4939.33
2,,,,,,,,,,,,,4,3,0,1,1,0,0,0,0,0,0,0,0,1,1,0,0,1,1,1,0,1,0,0,1,0,0,0,1,0,0,0,52933.695,19149.39937,10222.935
2,,,,,,,,,,,,,2,0,0,1,1,0,0,0,0,0,0,0,0,1,1,0,0,1,1,1,0,1,0,0,0,0,0,0,0,0,0,0,9309.165,3367.702149,2250.345
2,,,,,,,,,,,,,0,0,0,0,0,0,0,0,0,0,0,0,0,0,0,0,0,0,0,0,0,0,0,0,0,0,0,0,0,0,0,0,2645.46,957.0269005,316.305
2,,,,,,,,,,,,,0,0,0,1,1,0,0,0,0,0,0,0,0,1,1,0,0,1,0,1,1,1,0,0,0,0,0,0,0,0,0,0,65868.795,21819.36769,14229.318
2,,,,,,,,,,,,,0,0,0,0,0,0,0,0,0,0,0,0,0,0,0,0,0,0,0,0,0,0,0,0,0,0,0,0,0,0,0,0,2444.9,809.8853495,322.089
2,,,,,,,,,,,,,2,0,1,1,1,0,0,0,0,0,0,0,0,1,1,0,0,1,1,1,1,1,0,0,0,0,0,0,0,0,0,0,23865.413,7905.537383,3886.328
2,,,,,,,,,,,,,10,0,1,1,1,0,1,0,0,0,0,0,0,0,0,0,0,0,1,1,1,1,0,0,0,0,0,0,0,0,0,0,74287.755,24608.19028,15530.43
2,,,,,,,,,,,,,37,3,1,1,1,0,1,1,0,0,1,0,0,1,1,0,0,0,1,1,1,1,0,0,1,0,1,0,1,0,0,0,421457.177,139609.7972,88688.216
2,,,,,,,,,,,,,2,0,1,1,1,0,1,0,0,0,0,0,0,1,1,0,0,0,1,1,1,1,0,0,0,0,0,0,0,0,0,0,20735.941,6868.884136,3950.108
2,,,,,,,,,,,,,5,1,1,0,0,0,1,1,0,0,1,0,0,1,1,0,0,0,1,1,1,1,0,0,1,0,1,0,1,0,0,0,76213.911,25246.23909,13893.41
2,,,,,,,,,,,,,1,0,1,1,1,0,1,1,0,0,1,0,0,1,1,0,0,0,1,1,1,1,0,0,0,0,0,0,0,0,0,0,8221.5,2503.298763,1677.9
2,,,,,,,,,,,,,2,0,1,1,1,0,1,1,0,1,1,0,0,1,1,0,1,0,1,1,1,1,0,0,0,0,0,0,0,0,0,0,49240.8,14992.93727,12525.45
2,,,,,,,,,,,,,0,0,0,0,0,0,0,0,0,0,0,0,0,0,0,0,0,0,0,0,0,0,0,0,0,0,0,0,0,0,0,0,4265.172,1288.337854,488.3
2,,,,,,,,,,,,,1,0,0,1,1,0,1,1,0,1,1,0,0,1,1,0,0,1,1,1,0,1,0,0,0,0,0,0,0,0,0,0,14981.044,4525.174151,2362.344
3,1,5.252054795,0,11,2.893150685,12.21917808,4,3,0,3,1,16,0,0,1,0,0,0,0,0,0,0,0,0,0,0,0,0,0,0,0,1,1,0,0,0,0,0,0,0,0,0,0,0,2346.475,1048.494196,588.675
3,,,,,,,,,,,,,2,0,1,1,1,0,0,0,0,0,0,0,0,0,0,0,0,0,1,1,1,1,0,0,0,0,0,0,0,0,0,0,18351.2,7419.261702,3357.76
3,,,,,,,,,,,,,3,0,1,1,1,0,0,1,0,0,1,0,0,0,0,0,0,0,1,1,1,1,0,0,0,0,0,0,0,0,0,0,26565.28,10740.15675,5091.52
3,,,,,,,,,,,,,12,4,1,1,1,0,1,0,0,0,0,0,0,1,1,0,0,0,1,1,1,1,0,0,1,0,0,0,1,0,0,0,154725.76,11168.6259,30618.56
3,,,,,,,,,,,,,9,0,1,1,1,0,1,1,0,0,1,0,0,1,1,0,0,0,1,1,1,1,0,0,0,0,0,0,0,0,0,0,80045.298,28924.44848,16860.888
3,,,,,,,,,,,,,0,0,1,1,1,0,1,1,0,0,1,0,0,1,1,0,0,0,1,1,1,1,0,0,0,0,0,0,0,0,0,0,22306.968,8060.645194,3896.802
3,,,,,,,,,,,,,17,16,1,1,1,0,1,1,0,0,1,0,0,1,1,0,1,1,1,1,1,1,0,0,1,0,1,0,1,0,1,0,344128.572,124351.2036,64735.884
3,,,,,,,,,,,,,4,0,1,1,1,0,1,1,0,1,1,0,0,1,1,0,0,0,1,1,1,1,0,0,0,0,0,0,0,0,0,0,34226.856,12367.90864,7306.092
3,,,,,,,,,,,,,4,0,1,1,1,0,1,1,0,1,1,0,0,1,1,0,0,0,1,1,1,1,0,0,0,0,0,0,0,0,0,0,39346.83,14218.01637,8051.634
3,,,,,,,,,,,,,14,0,1,1,1,0,1,1,0,1,0,0,0,1,1,0,0,0,1,1,1,1,0,0,0,0,0,0,0,0,0,0,112999.572,40832.50834,24933.384
3,,,,,,,,,,,,,3,0,0,1,1,0,1,1,0,1,0,0,0,1,1,0,0,0,1,1,1,1,0,0,0,0,0,0,0,0,0,0,20950.766,7944.823778,4661.256
3,,,,,,,,,,,,,20,14,0,1,1,0,1,1,0,1,0,0,0,1,1,0,0,0,1,1,1,1,0,0,1,0,1,0,1,0,1,0,445138.046,168802.579,84604.826
3,,,,,,,,,,,,,11,5,1,1,1,0,1,1,0,1,0,0,0,1,1,0,0,0,0,1,1,1,0,0,1,0,0,0,1,0,0,0,139078.116,52740.36868,28116.852
3,,,,,,,,,,,,,0,0,0,0,0,0,0,0,0,0,0,0,0,0,0,0,0,0,0,0,0,0,0,0,0,0,0,0,0,0,0,0,2279.774,864.5222176,292.14
3,,,,,,,,,,,,,27,23,1,1,1,0,1,1,0,1,0,0,0,1,1,0,0,0,0,1,1,1,0,0,1,0,1,0,1,0,1,0,604470.57,218674.4823,114258.525
3,,,,,,,,,,,,,14,0,1,0,0,0,1,1,0,1,0,0,0,1,1,0,0,0,0,1,1,1,1,0,0,0,0,0,0,0,0,0,143477.362,47527.59355,29001.829
4,1,0.430136986,0,6,2.320547945,10.03287671,3,5,0,2,1,30,6,0,1,1,1,0,1,0,0,0,0,0,0,1,1,0,0,0,0,1,1,1,0,0,0,0,0,0,0,0,0,0,90328.125,40362.03872,21131.2
4,,,,,,,,,,,,,2,0,1,0,0,0,1,1,0,0,1,0,0,1,1,0,0,0,0,1,0,1,0,0,0,0,0,0,0,0,0,0,23339.475,8443.335155,3794.595
4,,,,,,,,,,,,,4,0,1,0,0,0,1,0,0,0,0,0,0,1,1,0,0,0,0,1,1,1,0,0,0,0,0,0,0,0,0,0,26438.625,9564.489857,5559.3
4,,,,,,,,,,,,,2,0,1,0,0,0,1,1,0,0,1,0,0,1,1,0,0,0,0,1,1,1,0,0,0,0,0,0,0,0,0,0,19300.995,6982.366553,3720.045
4,,,,,,,,,,,,,0,0,0,0,0,0,1,0,0,0,0,0,0,1,0,1,0,0,0,1,1,1,0,0,1,0,0,0,1,0,0,0,60840.255,22009.69233,13111.215
4,,,,,,,,,,,,,9,0,1,0,0,0,1,1,0,0,1,0,0,1,1,0,0,0,0,1,1,1,0,0,0,0,0,0,0,0,0,0,78290.28,28322.44827,15428.655
4,,,,,,,,,,,,,4,0,1,0,0,0,1,1,0,0,1,0,0,1,1,0,0,0,0,1,1,1,0,0,0,0,0,0,0,0,0,0,41714.246,13818.05256,7484.583
4,,,,,,,,,,,,,4,0,1,0,0,0,1,1,0,0,1,0,0,1,1,0,0,0,0,1,1,1,0,0,0,0,0,0,0,0,0,0,31218.184,10341.17954,6085.675
4,,,,,,,,,,,,,2,0,1,0,0,0,1,1,0,0,1,0,0,1,1,0,0,0,0,1,1,1,0,0,0,0,0,0,0,0,0,0,14391.957,4767.407716,3130.535
4,,,,,,,,,,,,,0,0,0,0,0,0,1,1,0,0,1,0,0,1,1,0,0,0,0,1,1,1,0,0,0,0,0,0,0,0,0,0,38681.507,12813.4426,7184.817
4,,,,,,,,,,,,,2,0,1,0,0,0,1,1,0,0,1,0,0,1,1,0,0,0,0,1,1,1,0,0,0,0,0,0,0,0,0,0,30521.919,10110.53828,5292.677
4,,,,,,,,,,,,,2,0,1,0,0,0,1,1,0,0,1,0,0,1,1,0,0,0,0,1,1,1,0,0,0,0,0,0,0,0,0,0,26791.852,8874.934934,4819.642
4,,,,,,,,,,,,,2,0,1,0,0,0,1,1,0,0,1,0,0,1,1,0,0,0,0,1,1,1,0,0,0,0,0,0,0,0,0,0,14927.709,4944.878245,3166.677
4,,,,,,,,,,,,,20,7,1,0,0,0,1,1,0,1,1,0,0,1,1,0,0,0,0,1,1,1,0,0,1,0,1,0,1,0,1,0,243303.692,80595.56449,50093.875
4,,,,,,,,,,,,,1,0,0,0,0,0,1,1,0,0,1,0,0,1,1,0,0,0,0,1,1,1,0,0,0,0,0,0,0,0,0,0,5555.238,1840.200364,1320.246
4,,,,,,,,,,,,,1,0,1,0,0,0,1,1,0,0,1,0,0,1,1,0,0,0,0,1,1,1,0,0,1,0,0,0,0,0,1,0,12228.752,4050.835244,2248.245
4,,,,,,,,,,,,,170,110,1,0,0,0,1,1,0,1,0,0,0,1,0,0,1,0,1,1,1,1,0,0,1,0,1,0,1,1,1,0,4191319.65,1276181.39,1106935.2
4,,,,,,,,,,,,,0,0,0,0,0,0,0,0,0,0,0,0,0,1,0,0,1,0,0,0,0,0,0,0,0,0,0,0,0,0,0,0,27172.95,8273.674162,5472.6
4,,,,,,,,,,,,,3,0,1,0,0,0,1,1,0,1,0,0,0,0,0,0,0,0,0,0,0,0,0,0,0,0,0,0,0,0,0,0,34315.05,10448.31505,9930.9
4,,,,,,,,,,,,,3,0,1,0,0,0,1,1,0,1,0,0,0,1,0,0,1,0,0,0,0,0,0,0,0,0,0,0,0,0,0,0,65319.45,19888.59677,21733.95
4,,,,,,,,,,,,,2,0,1,0,0,0,1,1,0,1,0,0,0,1,0,0,1,0,0,0,0,0,0,0,0,0,0,0,0,0,0,0,31010.7,9442.199957,5458.95
4,,,,,,,,,,,,,2,1,1,0,0,0,1,1,0,1,0,0,0,0,0,0,0,0,0,0,0,0,0,0,1,0,0,0,1,0,0,0,43969.8,13388.01264,13971.3
4,,,,,,,,,,,,,41,10,1,0,0,0,1,1,0,1,1,0,0,1,0,0,1,0,0,1,1,0,0,0,1,0,1,0,1,0,0,0,770828.1,234703.2815,203018.55
4,,,,,,,,,,,,,33,0,1,0,0,0,1,1,0,0,1,0,0,1,0,0,1,0,0,1,1,0,0,0,0,0,0,0,0,0,0,0,465257.1,141662.4123,93726.15
4,,,,,,,,,,,,,33,2,1,0,0,0,1,1,0,0,1,0,0,0,0,0,0,0,0,1,1,0,0,0,1,0,1,0,0,0,0,0,475423.272,143606.3535,91778.812
4,,,,,,,,,,,,,18,2,1,0,0,0,1,1,0,0,1,0,0,0,0,0,0,0,0,1,1,0,0,0,0,0,0,0,0,0,0,0,255991.532,77324.80216,50883.944
4,,,,,,,,,,,,,22,4,1,0,0,0,1,1,0,0,1,0,0,1,0,0,1,0,0,1,1,0,0,0,1,0,0,0,1,0,0,0,374275.268,113053.5875,73946.096
4,,,,,,,,,,,,,2,0,1,0,0,0,1,1,0,0,1,0,0,0,0,0,0,0,0,1,1,0,0,0,0,0,0,0,0,0,0,0,46843.904,14149.66964,7466.364
4,,,,,,,,,,,,,0,0,0,0,0,0,0,0,0,0,0,0,0,0,0,0,0,0,0,0,0,0,0,0,0,0,0,0,0,0,0,0,3584.636,1082.77515,409.144
4,,,,,,,,,,,,,0,0,1,0,0,0,1,1,0,0,1,0,0,1,0,0,1,0,0,1,1,0,0,0,1,0,0,0,1,0,0,0,40441.52,12215.76553,9897.584
5,1,3.208219178,0,11,2.134246575,12.03561644,2,3,1,3,1,18,1,0,1,0,0,0,0,0,0,0,0,0,0,1,1,0,0,0,0,1,1,1,0,0,0,0,0,0,0,0,0,0,10607.52,4288.546083,1831.2
5,,,,,,,,,,,,,0,0,0,0,0,0,0,0,0,0,0,0,0,0,0,0,0,0,0,0,0,0,0,0,0,0,0,0,0,0,0,0,19535.04,7897.879927,3564.96
5,,,,,,,,,,,,,2,0,1,1,1,0,0,0,0,0,0,0,0,1,1,0,0,0,0,1,1,1,0,0,0,0,0,0,0,0,0,0,13122.735,4346.971582,2886.045
5,,,,,,,,,,,,,4,0,1,1,1,0,0,1,0,0,1,0,0,1,1,0,0,0,0,1,1,1,0,0,0,0,0,0,0,0,0,0,45822.741,15179.01207,9264.045
5,,,,,,,,,,,,,4,0,1,1,1,0,0,1,0,0,1,0,0,1,1,0,0,0,0,1,1,1,0,0,0,0,0,0,0,0,0,0,45822.741,15179.01207,9102.469
5,,,,,,,,,,,,,1,0,1,1,1,0,0,1,0,0,1,0,0,1,1,0,0,0,0,1,1,1,0,0,0,0,0,0,0,0,0,0,14911.764,4939.596384,3603.57
5,,,,,,,,,,,,,0,0,0,1,1,0,0,0,0,0,0,0,0,0,0,0,0,0,0,1,0,1,0,0,0,0,0,0,0,0,0,0,26014.799,8617.532243,4846.217
5,,,,,,,,,,,,,2,0,1,1,1,0,0,0,0,0,0,0,0,1,1,0,0,0,0,1,1,1,0,0,0,0,0,0,0,0,0,0,21058.8,6412.025542,3664.5
5,,,,,,,,,,,,,1,0,1,1,1,0,0,1,0,0,1,0,0,1,1,0,0,0,0,1,1,1,0,0,0,0,0,0,0,0,0,0,8553.3,2604.325891,1926.75
5,,,,,,,,,,,,,0,0,1,1,1,0,0,1,0,1,1,0,0,1,1,0,0,0,0,1,1,1,0,0,0,0,0,0,0,0,0,0,14833.012,4480.459605,1905.912
5,,,,,,,,,,,,,0,0,0,0,0,0,0,0,0,0,0,0,0,1,0,0,1,0,0,0,0,0,0,0,1,0,1,0,1,0,0,0,28743.908,8682.38485,5383.636
5,,,,,,,,,,,,,3,0,1,1,1,0,0,1,0,1,1,0,0,1,1,0,0,0,0,1,1,1,0,0,1,0,0,0,1,0,0,0,38138.8,11520.20593,7848.78
5,,,,,,,,,,,,,3,0,1,1,1,0,0,1,0,1,1,0,0,1,1,0,0,0,0,1,1,1,0,0,0,0,0,0,0,0,0,0,29692.752,8968.992669,5092.712
5,,,,,,,,,,,,,0,0,0,0,0,0,0,0,0,0,0,0,0,0,0,0,0,0,0,0,0,0,0,0,0,0,0,0,0,0,0,0,2850.644,861.0655266,376.248
5,,,,,,,,,,,,,0,0,0,1,1,0,0,1,0,1,0,0,0,1,0,0,1,0,0,1,1,1,0,0,1,0,1,0,1,0,0,0,23272.892,7029.809758,4059.572
5,,,,,,,,,,,,,2,0,1,1,1,0,0,1,0,1,1,0,0,1,1,0,0,0,0,1,1,1,0,0,0,0,0,0,0,0,0,0,32259.668,9744.355316,5951.092
5,,,,,,,,,,,,,2,0,1,1,1,0,0,1,0,1,1,0,0,1,1,0,0,0,0,1,1,1,0,0,0,0,0,0,0,0,0,0,23499.052,7098.123647,4767.864
5,,,,,,,,,,,,,7,1,1,1,1,0,1,1,0,1,1,0,0,1,1,0,1,0,0,1,1,1,0,0,1,0,1,0,1,0,0,0,136297.38,41169.9866,25209.644
6,1,9.202739726,1,11,2.178082192,12.07123288,2,4,1,2,1,10,0,0,0,1,1,0,0,0,0,0,0,0,0,0,0,0,0,0,0,0,0,0,0,0,0,0,0,0,0,0,0,0,57640.995,20852.32163,11779.965
6,,,,,,,,,,,,,2,2,0,1,1,0,0,0,0,0,0,0,0,0,0,0,0,0,0,0,0,0,0,0,0,0,0,0,0,0,0,0,31239.645,11301.31645,6658.38
6,,,,,,,,,,,,,6,0,0,1,1,0,0,0,0,0,0,0,0,0,0,0,0,0,0,0,0,0,0,0,0,0,0,0,0,0,0,0,57972.21,20972.14263,11489.22
6,,,,,,,,,,,,,2,0,0,1,1,0,0,0,0,0,0,0,0,0,0,0,0,0,0,0,0,0,0,0,0,0,0,0,0,0,0,0,20454.39,7399.621035,3648.69
6,,,,,,,,,,,,,5,0,1,1,1,0,0,0,0,0,0,0,0,1,1,0,0,0,0,1,1,1,0,0,0,0,0,0,0,0,0,0,49409.303,16367.07867,9480.897
6,,,,,,,,,,,,,0,0,0,0,0,0,0,0,0,0,0,0,0,0,0,0,0,0,0,0,0,0,0,0,1,0,0,0,1,0,0,0,36450.27,12074.33419,6787.255
6,,,,,,,,,,,,,0,0,0,0,0,0,0,0,0,0,0,0,0,1,0,0,1,0,0,0,0,0,0,0,0,0,0,0,0,0,0,0,53280.15,16222.84663,11317.95
6,,,,,,,,,,,,,1,1,0,1,1,0,0,0,0,0,0,0,0,1,1,0,0,0,0,1,0,1,0,0,1,0,0,0,1,0,0,0,20036.1,6100.6318,3291.75
6,,,,,,,,,,,,,2,0,0,0,0,0,0,0,0,0,0,0,0,1,1,0,0,0,0,1,0,1,0,0,0,0,0,0,0,0,0,0,10603.82,3202.989869,2487.76
6,,,,,,,,,,,,,0,0,0,0,0,0,0,0,0,0,0,0,0,1,1,0,0,0,0,0,0,0,0,0,0,0,0,0,0,0,0,0,8069.8,2437.563788,1961.424
7,1,2.082191781,0,2,2.068493151,6.843835616,2,5,1,2,1,10,1,0,1,1,1,0,1,1,0,0,1,0,0,1,1,0,0,0,0,1,1,1,0,0,0,0,0,0,0,0,0,0,5379.15,2403.608628,1316
7,,,,,,,,,,,,,0,0,1,1,1,0,0,0,0,0,0,0,0,1,1,0,0,0,0,1,1,1,0,0,0,0,0,0,0,0,0,0,4902.1,2190.44456,1131.525
7,,,,,,,,,,,,,1,0,1,1,1,0,0,0,0,0,0,0,0,1,1,0,0,0,0,1,1,1,0,0,0,0,0,0,0,0,0,0,8592.775,3839.578395,1863.55
7,,,,,,,,,,,,,0,0,0,1,1,0,0,0,0,0,0,0,0,1,1,0,0,0,0,1,1,1,0,0,1,0,0,0,1,0,0,0,31347.252,11687.41539,8796.004
7,,,,,,,,,,,,,6,3,0,1,1,0,1,1,0,0,1,0,0,1,1,0,0,0,0,1,1,1,0,0,1,0,0,0,1,0,0,0,87831.724,32746.91648,16069.556
7,,,,,,,,,,,,,2,0,1,1,1,0,0,1,0,0,1,0,0,1,0,0,0,1,0,1,0,1,0,0,0,0,0,0,0,0,0,0,14781.772,5511.191527,3160.504
7,,,,,,,,,,,,,0,0,0,1,1,0,1,0,0,0,0,0,0,0,0,0,0,0,0,1,1,1,0,0,1,0,1,0,0,0,0,0,25121.036,9366.051699,4633.248
7,,,,,,,,,,,,,19,6,1,1,1,0,1,0,0,0,0,0,0,1,0,0,0,1,0,1,1,1,0,0,1,0,1,0,1,0,0,0,222372.64,89903.70174,43643.04
7,,,,,,,,,,,,,1,0,0,1,1,0,1,0,0,0,0,0,0,1,1,0,0,1,0,1,1,1,0,0,1,0,0,0,1,0,0,0,26816.16,10841.58577,4222.4
7,,,,,,,,,,,,,3,1,1,1,1,0,1,0,0,0,0,0,0,1,0,0,0,1,0,1,1,1,0,0,0,0,0,0,0,0,0,0,19663.84,7949.952865,4193.28
8,1,3.101369863,0,5,13.63287671,4.942465753,2,5,1,1,1,4,4,1,0,0,0,0,0,0,0,0,0,0,0,1,1,0,0,1,1,1,1,1,0,0,0,0,0,0,0,0,0,0,69201.625,30921.91571,18803.525
8,,,,,,,,,,,,,6,0,0,0,0,0,0,0,0,0,0,0,0,1,1,0,0,1,1,1,1,1,0,0,1,0,1,0,0,0,0,0,51268.6,19114.83102,11867.496
8,,,,,,,,,,,,,26,10,1,0,0,0,1,0,0,0,0,0,0,1,0,0,1,1,1,1,1,1,0,0,1,0,1,1,1,0,1,0,518484.96,209619.8399,97107.36
8,,,,,,,,,,,,,4,0,0,0,0,0,0,0,0,0,0,0,0,1,0,0,0,1,1,1,0,1,0,0,0,0,0,0,0,0,0,0,32149.6,12997.85823,7477.12
9,1,0.419178082,0,1,3.016438356,8.005479452,1,5,0,3,1,1,1,0,1,0,0,0,1,0,0,0,0,0,0,0,0,0,0,0,0,0,0,0,0,0,0,0,0,0,0,0,0,0,18863.25,5743.520087,3631.95
10,1,4.323287671,0,5,2.38630137,2.805479452,2,3,0,1,1,3,2,0,0,0,0,0,0,0,0,0,0,0,0,1,1,0,0,0,0,0,0,0,0,0,0,0,0,0,0,0,0,0,19287.86,7191.227859,3361.648
10,,,,,,,,,,,,,5,1,0,1,1,0,0,0,0,0,0,0,0,1,1,0,0,0,0,1,1,1,0,0,0,0,0,0,0,0,0,0,33610.7,12531.31256,7591.452
10,,,,,,,,,,,,,0,0,0,1,1,0,0,0,0,0,0,0,0,1,1,0,0,0,0,1,1,1,0,0,0,0,0,0,0,0,0,0,33340.16,13479.19331,8973.44
11,1,1.194520548,0,11,1.78630137,1.698630137,2,3,0,3,1,3,10,6,0,1,1,0,1,0,0,0,0,0,0,0,0,0,0,0,0,1,1,1,0,0,1,0,1,0,1,0,1,0,285302.925,127484.1884,55623.325
11,,,,,,,,,,,,,7,4,0,1,1,0,0,0,0,0,0,0,0,0,0,0,0,0,0,1,1,1,0,0,0,0,0,0,0,0,0,0,90704.384,33817.95042,16348.152
11,,,,,,,,,,,,,3,1,0,1,1,0,0,0,0,0,0,0,0,1,1,0,0,0,0,1,1,0,0,0,0,0,0,0,0,0,0,0,30526.492,11381.4057,5449.384
12,1,0.076712329,0,6,1.734246575,0.457534247,1,5,0,3,1,2,2,0,0,1,1,0,0,0,0,0,0,0,0,1,1,0,0,0,0,1,1,1,0,0,0,0,0,0,0,0,0,0,16762.55,7490.144317,3173.675
12,,,,,,,,,,,,,105,45,1,1,1,0,1,1,0,1,0,0,0,1,1,0,1,0,0,1,1,1,0,0,1,1,1,1,1,0,1,0,1437034.4,642121.5772,281499.45
13,1,27.26849315,1,5,11.81369863,31.29041096,2,4,0,4,0,61,2,2,0,0,0,0,0,0,0,0,0,0,0,1,1,0,0,1,0,1,1,0,0,0,1,1,0,0,0,0,0,1,26045.05,11637.91805,4409.775
13,,,,,,,,,,,,,4,2,0,0,0,0,0,0,0,0,0,0,0,1,1,0,0,1,0,1,1,0,0,0,1,1,1,0,1,0,1,1,92560.625,41359.60455,22468.35
13,,,,,,,,,,,,,2,1,0,0,0,0,1,1,0,1,0,0,0,1,1,0,0,1,0,1,1,0,0,0,1,1,0,0,1,0,0,1,28302.348,10552.16252,5234.368
13,,,,,,,,,,,,,1,1,0,0,0,0,0,1,0,1,0,0,0,1,1,0,0,1,0,1,1,0,0,0,0,0,0,0,0,0,0,1,11857.092,4420.76261,1951.328
13,,,,,,,,,,,,,0,0,0,0,0,0,0,0,0,0,0,0,0,0,0,0,0,0,0,0,0,0,0,0,1,0,0,0,1,0,0,0,7240.028,2699.350319,1102.824
13,,,,,,,,,,,,,6,6,0,0,0,0,0,1,0,1,0,0,0,1,1,0,1,1,0,1,1,0,0,0,1,1,1,1,1,0,0,1,129763.312,48380.56396,25947.576
13,,,,,,,,,,,,,5,4,0,0,0,0,1,1,0,1,0,0,0,1,0,0,0,1,0,1,1,0,0,0,1,0,1,0,1,0,0,1,104181.032,38842.54343,23209.012
13,,,,,,,,,,,,,2,0,0,0,0,0,0,1,0,1,0,0,0,1,1,0,0,1,0,1,1,0,0,0,0,0,0,0,0,0,0,1,14780.64,5975.709288,2871.68
13,,,,,,,,,,,,,11,9,1,0,0,0,0,1,0,1,1,0,0,1,1,0,0,1,0,1,1,0,0,0,1,1,0,0,0,0,0,1,131677.28,53236.20256,28677.6
13,,,,,,,,,,,,,5,0,0,0,0,0,0,1,0,1,0,0,0,1,1,0,0,1,0,1,1,0,0,0,0,0,0,0,0,0,0,1,27843.2,11256.81086,6455.68
13,,,,,,,,,,,,,5,5,1,0,0,0,0,1,0,1,0,0,0,1,1,0,0,1,0,1,1,0,0,0,1,1,1,0,0,0,0,1,66689.28,26962.00908,14427.84
13,,,,,,,,,,,,,0,0,0,0,0,0,0,1,0,1,0,0,0,0,0,0,0,0,0,1,1,0,0,0,0,0,0,0,0,0,0,1,7246.4,2929.668795,1165.92
13,,,,,,,,,,,,,2,2,1,0,0,0,0,1,0,1,0,0,0,1,1,0,0,1,0,1,1,0,0,0,1,1,0,0,0,0,0,1,44097.76,17828.41568,8365.28
13,,,,,,,,,,,,,4,4,1,0,0,0,0,1,0,1,0,0,0,1,1,0,0,1,0,1,1,0,0,0,1,1,0,0,0,0,0,1,52996.16,21425.97651,10688.16
13,,,,,,,,,,,,,5,5,1,0,0,0,0,1,0,1,0,0,0,1,1,0,0,1,0,1,1,0,1,0,1,1,0,0,0,0,0,1,76058.08,30749.74934,14295.68
13,,,,,,,,,,,,,4,4,0,0,0,0,1,1,0,1,0,0,0,1,1,0,0,1,0,1,1,0,0,0,1,1,0,0,1,0,0,1,55188,22312.12208,10384.64
13,,,,,,,,,,,,,2,1,0,0,0,0,0,1,0,1,0,0,0,1,0,0,0,1,0,1,1,0,0,0,1,1,0,0,1,0,0,1,22603.84,9138.574285,4351.2
13,,,,,,,,,,,,,2,2,1,0,0,0,0,1,0,1,0,0,0,1,1,0,0,1,0,1,1,0,1,0,1,1,0,0,0,0,0,1,27684.972,10003.99232,5231.97
13,,,,,,,,,,,,,1,1,1,0,0,0,0,1,0,1,0,0,0,1,1,0,0,1,0,1,1,0,1,0,1,1,0,0,0,0,0,1,9163.908,3311.38732,1598.688
13,,,,,,,,,,,,,1,1,1,0,0,0,0,0,0,0,0,0,0,1,1,0,0,0,0,1,1,0,1,0,1,1,0,0,0,0,0,1,13098.042,4732.990575,2620.926
13,,,,,,,,,,,,,1,1,1,0,0,0,0,1,0,1,0,0,0,1,0,0,0,1,0,1,1,0,1,0,1,1,0,0,0,0,0,1,15130.44,5467.399624,3023.892
13,,,,,,,,,,,,,1,1,1,0,0,0,0,1,0,1,0,0,0,1,1,0,0,1,0,1,1,0,1,0,1,1,0,0,1,0,0,1,14429.916,5214.264577,2612.142
13,,,,,,,,,,,,,2,2,1,0,0,0,0,1,0,1,0,0,0,1,0,0,0,1,0,1,1,0,1,0,1,1,0,0,0,0,0,1,26193.888,9465.187623,5257.224
13,,,,,,,,,,,,,1,1,0,0,0,0,0,0,0,0,0,0,0,1,1,0,0,1,0,1,1,0,1,0,1,1,0,0,1,0,0,1,16144.522,6122.228766,3088.028
13,,,,,,,,,,,,,10,10,1,0,0,0,0,1,1,0,0,0,0,1,1,0,1,1,0,1,1,0,1,0,1,1,0,0,1,0,0,1,157214.235,56874.13608,33221.61
13,,,,,,,,,,,,,28,28,1,0,0,0,1,1,1,1,0,0,0,1,1,0,1,1,0,1,1,0,0,0,1,1,1,0,1,0,0,1,496255.92,179526.5341,132456.18
13,,,,,,,,,,,,,1,1,0,0,0,0,1,0,0,0,0,0,0,1,1,0,0,1,0,1,1,0,0,0,1,1,0,0,0,0,0,1,14344.485,5189.289583,3114.06
13,,,,,,,,,,,,,1,1,1,0,0,0,0,1,1,0,0,0,0,1,1,0,0,1,0,1,1,0,0,0,1,1,0,0,0,0,0,1,13248.6,4792.840033,2890.41
13,,,,,,,,,,,,,1,1,1,0,0,0,0,1,1,0,0,0,0,1,1,0,0,1,0,1,1,0,0,0,1,1,0,0,0,0,0,1,17634.27,6379.408784,3748.8
13,,,,,,,,,,,,,4,4,1,0,0,0,1,1,1,0,0,0,0,1,1,0,0,1,0,1,1,0,0,0,1,1,0,0,0,0,0,1,55372.733,18342.49467,11954.498
13,,,,,,,,,,,,,1,1,1,0,0,0,0,1,1,0,0,0,0,1,0,0,0,1,0,1,1,0,0,0,1,1,0,0,0,0,0,1,16252.207,5383.62483,3538.727
13,,,,,,,,,,,,,1,1,1,0,0,0,1,1,1,0,0,0,0,1,1,0,0,1,0,1,1,0,0,0,1,1,0,0,0,0,0,1,19414.632,6431.193923,4151.015
13,,,,,,,,,,,,,1,1,1,0,0,0,0,1,1,0,0,0,0,1,1,0,0,1,0,1,1,0,0,0,1,1,0,0,0,0,0,1,14490.816,4800.155254,3016.794
13,,,,,,,,,,,,,1,1,1,0,0,0,1,1,1,0,0,0,0,1,1,0,0,1,0,1,1,0,0,0,1,1,0,0,1,0,0,1,14428.099,4779.379934,3076.322
13,,,,,,,,,,,,,6,6,1,0,0,0,1,1,1,0,0,0,0,1,1,0,0,1,0,1,1,0,0,0,1,1,0,0,1,0,0,1,96405.596,31934.8357,21019.762
13,,,,,,,,,,,,,4,4,1,0,0,0,0,1,1,0,0,0,0,1,0,0,0,1,0,1,1,0,0,0,1,1,0,0,0,0,0,1,60421.2,18397.16782,13353.9
13,,,,,,,,,,,,,1,1,1,0,0,0,0,1,1,0,0,0,0,1,1,0,0,0,0,1,1,0,0,0,1,1,0,0,1,0,0,1,15793.05,4808.69945,3271.8
13,,,,,,,,,,,,,1,1,1,0,0,0,0,1,1,0,0,0,0,1,1,0,0,0,0,1,1,0,0,0,1,1,0,0,1,0,0,1,14761.95,4494.74806,3098.55
13,,,,,,,,,,,,,1,1,1,0,0,0,0,0,0,0,0,0,0,1,1,0,0,1,0,1,1,0,0,0,1,1,0,0,0,0,0,1,18852.75,5740.323026,4442.55
13,,,,,,,,,,,,,1,1,1,0,0,0,0,1,1,0,0,0,0,1,1,0,0,1,0,1,1,0,0,0,1,1,0,0,0,0,0,1,17637.9,5370.423068,3789.45
13,,,,,,,,,,,,,3,3,0,0,0,0,0,1,1,0,0,0,0,1,1,0,0,1,0,1,1,0,0,0,1,1,0,0,1,0,0,1,66998.4,20399.80683,15153.6
13,,,,,,,,,,,,,2,2,1,0,0,0,0,1,1,0,0,0,0,1,1,0,0,1,0,1,1,0,0,0,1,1,0,0,1,0,0,1,22119.3,6734.928703,5268.9
13,,,,,,,,,,,,,1,1,1,0,0,0,0,0,0,0,0,0,0,1,0,0,0,1,0,1,1,0,0,0,1,1,0,0,0,0,0,1,23674.35,7208.413437,5575.5
13,,,,,,,,,,,,,1,1,1,0,0,0,0,0,0,0,0,0,0,1,1,0,0,1,0,1,1,0,0,0,1,1,0,0,1,0,0,1,16066.05,4891.823036,3321.15
13,,,,,,,,,,,,,3,3,1,0,0,0,0,1,1,0,0,0,0,1,1,0,0,1,0,1,1,0,0,0,1,1,0,0,0,0,0,1,40120.5,12215.97008,8721.3
13,,,,,,,,,,,,,1,1,1,0,0,0,0,0,0,0,0,0,0,1,1,0,0,0,0,1,1,0,0,0,1,1,0,0,1,0,0,1,21081.9,6419.059076,4027.8
13,,,,,,,,,,,,,1,1,1,0,0,0,0,1,1,0,0,0,0,1,1,0,0,1,0,1,1,0,0,0,1,1,0,0,0,0,0,1,17986.5,5476.565493,3770.55
13,,,,,,,,,,,,,1,1,1,0,0,0,1,1,1,0,0,0,0,1,1,0,0,1,0,1,1,0,0,0,1,1,0,0,0,0,0,1,16714.252,5048.706959,3603.14
13,,,,,,,,,,,,,1,1,1,0,0,0,0,1,1,0,0,0,0,1,1,0,0,1,0,1,1,0,0,0,1,1,0,0,1,0,0,1,12892.148,3894.202225,2802.328
13,,,,,,,,,,,,,1,1,1,0,0,0,0,0,0,0,0,0,0,1,1,0,0,1,0,1,1,0,0,0,1,1,0,0,0,0,0,1,15624.572,4719.558218,3569.216
13,,,,,,,,,,,,,1,1,1,0,0,0,1,1,1,0,0,0,0,1,1,0,0,1,0,1,1,0,0,0,1,1,0,0,0,0,0,1,13781.368,4162.800018,2977.088
13,,,,,,,,,,,,,1,1,1,0,0,0,1,1,1,0,0,0,0,1,1,0,0,1,0,1,1,0,0,0,1,1,0,0,1,0,0,1,10783.72,3257.330463,2338.7
13,,,,,,,,,,,,,3,3,1,0,0,0,0,1,1,0,0,0,0,1,1,0,0,1,0,1,1,0,0,0,1,1,0,0,0,0,0,1,39379.596,11895.00077,8551.932
13,,,,,,,,,,,,,1,1,1,0,0,0,0,1,1,0,0,0,0,1,1,0,0,0,0,1,1,0,0,0,1,1,0,0,0,0,0,1,19061.176,5757.618823,3887.896
13,,,,,,,,,,,,,1,0,1,0,0,0,0,0,0,0,0,0,0,1,1,0,0,0,0,1,1,0,0,0,1,1,0,0,0,0,0,1,17018.54,5140.620192,3730.612
13,,,,,,,,,,,,,1,1,1,0,0,0,0,0,0,0,0,0,0,1,1,0,0,0,0,1,1,0,0,0,1,1,0,0,0,0,0,1,19134.164,5779.665578,3914.624
13,,,,,,,,,,,,,1,1,1,0,0,0,0,1,1,0,0,0,0,1,1,0,0,1,0,1,1,0,0,0,1,1,0,0,0,0,0,1,17890.284,5403.939185,3841.636
13,,,,,,,,,,,,,1,0,1,0,0,0,0,1,1,0,0,0,0,1,1,0,0,1,0,1,1,0,0,0,1,1,0,0,0,0,0,1,17895.424,5405.491773,3952.66
13,,,,,,,,,,,,,1,1,1,0,0,0,0,1,1,0,0,0,0,1,1,0,0,0,0,1,1,0,0,0,1,1,0,0,0,0,0,1,18870.996,5700.173052,4054.432
13,,,,,,,,,,,,,1,1,1,0,0,0,0,1,1,0,0,0,0,1,1,0,0,1,0,1,1,0,0,0,1,1,0,0,0,0,0,1,17698.048,5345.872379,3715.192
13,,,,,,,,,,,,,1,1,1,0,0,0,0,1,1,0,0,0,0,1,1,0,0,1,0,1,1,0,0,0,1,1,0,0,0,0,0,1,16026.52,4840.970631,3449.968