AGI,CV,geom_mean,StressCV,TATA,Ypatch,CA,GA,Coreless,CGDB Circadian,Representative Gene Model Name,Gene Description,Gene Model Type,Primary Gene Symbol,All Gene Symbols,UTR_promoter_seq,UTR_terminator_seq
AT1G11060,0.206644595,497.6316315,0.202739488,0,0,0,0,1,N,AT1G11060.1,Encodes one of two redundant proteins (the other is WAPL2) that are involved in prophase removal of cohesion during meiosis. Double mutants with wapl2 exhibit reduced fertility due to defects in meiosis and also some abnormal embryo development in rare cases where embryos are formed.,protein_coding,WINGS APART-LIKE PROTEIN 1 (WAPL1),"ATWAPL1, WAPL1",TTTTGTCAACAAGAAATTACATAGTTTGATACATAATGATTTGTCAAAGCATTTTCAACAGAAAAAAATCAGATACATATTTTACTATTAATTTTATATCTGGTAAATTCTATATTTTACAGTATACAGTACATTACACAATTTCCTGAATCAGTTGAATATAAAATGCTCAAACTAGCATAAATTTAAAACTTTCCAGCATTGGTAATACTCAAAAAAAAAAATCAATAACAAATAAATGTTTAGTTGTAATTCAGACACAACTTGAAACCCCAAAAATCAGACTGTGAAAATTTGTGTGCTCTTTTTAACTTTTAATTGCTAAAGTTAGTTAGTAATTTAAAACATTCTGGTTACTCACTTAGTATTAGTTATTACTGTGGTAACAACAAAATTTA,AAAGGGATCAAAAAGGGCAATTAATTCTTCATTCTCCAATTTCTCTGTACAGCTTCTGCAATAGAAAAGAAAAAAGAACTTGGAATGCTTTGGGGTGATCACTAACTCTGGTGATCGCATTGATGTATGATATAAGATTATAAGGCTGCTATTAGTACGTTAGTTCTCTCTTTTAGAGTTATACTGTTTGTCTCGGCTTAGGTTTTGTTTAGTTGTCCTTTACAGTTTTACTCATACACTCCATTCTTTTTGTAGTTTTCTTGACTAATCCCATATATACAAGTTTGCTCTACCACTTTTTCTTTATAAATCTGTTCCATCGTTATAGTTTATATATAATTGTCATTACGTTATGATATTTCGCAGCATATTACAGTTTTGAAATGTGCATCTATGATCATTGAAGCTGTAAGGAAAAGTCGGCAAAAATTTATTAAATAGTTTTAGCTCTCTGAGATAAAACTCGTCTTTTC
AT1G18700,0.186549839,886.1215791,0.476444479,0,0,0,0,1,Y,AT1G18700.5,DNAJ heat shock N-terminal domain-containing protein;(source:Araport11),protein_coding,,,ATCATTTGTATTTTATTTAAAAATTATAAAGGTTTTGGCAATTTTATCTGTAAATTCGTAATACTATCTAATATTGTTTGGTAGTCGTCACATATTAATCTTTTTTTTTGTTTTTGTTAAAAATAACATATTAATCTTAAACCATAATTATATTTAATTTTAGAAAAAGAGAGATTTAGTATGCTGTGATCTGATAAGATACGATTTTAACCATAATAAAAGAGTATAATTACTTACTTAATGCTAAGAGTCGATCCCTTTTTTTATTTATTAAGAAAAACGCGGAAAAATAACCGAAGGAGATTTACACTTATCACATCGAGACTCTTTGATCGGAGTTTCCCAAAATCCCCG,TATATTAAGCCTTAGGATTCTTCTGACTTTCTTTTTTTTTGACATTTACGTTTTTTATTTTTTCTTTTCTTTGTGAAAGTCATAGGTTTCAATTTTAAGTTACTAAATAGAGTAATTTACCTTTATCATTTTGAACACTTCAAAATATTCGATCCCCTTTTGCTTATACAGTACCACATTTTAGATTTCCTAAATTGAAAGAAAAAACACAACTTATAAAACTAGCAATAATGCCAATATTTTCCATATATGTTGTATCACTCTTTGTTTATACTTTTATATTATTTGATTATAGACACGAAAGCTCTACAGAAACATCTCAAATCCAAAAAAAATAAAATATATTATATATATGCGTGTGTGTGAAAATTTTTGAGAAAAATTTCTAATTTAAAGAAAACAATCATAAACTAATTTAGAAACCCAGATCAAAAGTAGGAAATTTACATAAGACATATCATAGGGGTAAATCCAGAATCGGATTTATTTAGAGATGAAGTGCTCTATTTCTTGAAAAATGACAAAACTTTTTGGGTGGGCCTTCATTTTTTAAAACTTTTTTTGATAACTTTATTGCCCATATCTGTTTGTCGTCAACATTTTTGGAAAATTTCTTTTAAATGATTTTTGGTAATTAAAATCTTAAAAACTTGATTTTTTTAATTTAACATATTGAACTGTCTATATATATTCCTGACCAACCGTGCTGCTCCATATGGGACAACAACCTCTTTAGTGCGGTCCATGAAAGGTTTCCAGAGGCTATGACAACACCAACCTTATCTCGTGATTCAGTTTCACTTCAACCACAGAGTATAAAGGAAAAAGATTCAGACCCATTAGCTGATGGCGATTCTCAGGATATCATGTCTCCATATAAACATTATTTCGTGATTTCTCCAAAAAAAAATCTTGTCACTTCTATCTACTTTTTTTTTTTTTTTTCACTTCTATCTACTTAATTGAGTGGCATGCATAAATGAGTCTATATTTTTTTAACATTAATAAGAGAAAAAATATTTTACACTCTATATATTGTTTTCTTTTGGTACATTGTATACATCTCAACAAATACTAACAAAAGTGAAACGAATTTTGCAACGTATGATTGACGACAGCAATAACAAACGATCTCTTATGTTCTTCTTCGTTATGTTTTCTTCAATGTATGAAACGCTGAGAAATATAGCTTTCCAAAATTTCGATAATTTCTTGTGTAAAATCTTTCTCGAATTTTTATGTTAAACTATAACAAAAAAAAAGGAAGTACAGATACATGTACTATTTTCATTACAGTATATACATTAACATTGTTAACGTTGATAAGAAAACGAACGGATGTGGCTTTGGCTTATCTCTACGCGTCCATTTGTGTGAAACTTCGTATCAAACTATCGTTATCCTAAAATAAGACTTTTTATTTCTTTTGAAGCACGTTAAAATTTAACGAACAAGTAATTTAAGCGCGTGAGCAATGATGATTAACGCGGCATCAAATCATCAACTAACAAGTGGGAAACTAAAAAGGACAAATTGATATTTTTGTAAGAATTTTTAAGAAATAAGTGAGCTGTCTTAGACCATCATTATTGATGGTTGCTTAGTGTAGTTTTAGGTTAGTTCTTAAGAATATATATATATAATTGATTTTGAAAATTTTGATGTTAAGAGTTTAGTTAAGAGATTGAAATTTTAGTAATATGCAATGGTGGGATCTTAGCTTGAGTTCTTATAGCAAATAAATCAATTTAATCATTAATTTTTACATCCAATTAACCTAAGAACTACACTAAGAACCCTCCAATGATGATGCTCTTATATACTACTATATCTTTTCTTTTTGTTTCTAATAATATTTGCTACGATAACTTCCTTGTTCAGACTATATAGTAACTCGTCCAATTAAGGAGATATATTCTAAAATACCAAAATATATGCTTTCTTAAAATACTATACGTATAATTTTCAACAACAACAACAAATGATTAAGAAGATGTTCTGAAAAGTTTAAAATCATTCTTAAAACTGATATACACAACGATAACATAAAGACTACTCGTCTCGACTAATAAACAACTATGGTTGGTTCTATTATAATTACTTGGTCCCCAACGTTTATTACTCAAGATCCAAACATTCTACCACAAGGTGTTACGTTGCAGCGTGGTTGTCATATCTGTTTTCATGCGGTCACAACCACATGATTGGATTCTTTTTAATGTGGTCCAATATTAATTGTATTTCTTTTATTGAAGAGATAAGACATTGGATGAACGGTAACACCTTTGTCCAGTATTTTTTGTAGCCATCGTAGAAGATCAAAACAATAGCTTTTGAGAAGTTATTATCTTTGTCAGAAAGGAGTGAAGCAACGTTGAGAACAAGAAGAAGAAAAAGTAGAAAAAGAAATTTTATTGCAATCTCGTGTTTGCAAACAATATATTGACTTAACAATTTTTCGTGTTCTAATATCACTGTTTTCTTGTAGTTTACATTGGTCCATACTATTTTTACTCTCTCTTTTTTTTTGCGTAAAAGTAATCATTAATCAATCTCTCTCACTCTTTTTTACCACAAAGAAACAATTCTATGTTGTATCCATCATTATATATTTAACATCAGATTTTAATTTTCTTTTCTATCTTTGATATAGATTATTTTTACTATATCTTTTTCTTAAGAGCAATTGGCAATATATATAATTTTGGCTGATTAAAAGAGACATATAATTTTTATTTTGTAAAATGTACATCTCTTTCATACTTTCATAGTATTTTTAAAATAAAATTTATACTCCTTTGAAACAATATAATGACGATTTTAAAAAGGAAAACTCTTTTGGCCAATTCATATCTTTGTGTTCGACAACATTCCATGGCTTTGATTGCAGATTAATTTGGCCCTTCGAGCCACTGACTTAGGTTAGCTCACGTAAATTTTAGGAGTTTGACATCTTGAAATCGATACTTTTTCTTTTGTTTTCGTTATGTACATACGTTT
AT1G54080,0.138365461,3252.13058,0.196132178,1,1,0,1,0,N,AT1G54080.2,oligouridylate-binding protein 1A;(source:Araport11),protein_coding,OLIGOURIDYLATE-BINDING PROTEIN 1A (UBP1A),OLIGOURIDYLATE-BINDING PROTEIN 1A (UBP1A),CCGACGGCGTGAAGTTACCGGAAAACATAGATTACCTTAAAAGTTCTATTACTACTTTCACCTTGGAGGTAGATTTTTCGTTTTCAGTCACATGAATTTGGCAAGAAAAAAAGAAGAAGAAAAACTAACTACTTTAACCATAAACCTATAATATATTTTTTCACACTAAACTATAAATATATAATACCTATTTTACCTTTTATACATAAGTAACAACATCATCACAACTACCACTTTCACTATCATCACCACCACCGTTGTGACCATCATGTTATTACCATCCCTCCATCATCACTACCACTGTCATCAACGCCACACAAAAAAAAAAAACTCATGAAAATTATTGATAATAATCCATAAAAAGAATTTATACTTTTAATATCTAAATTTTACTCAAATCAAATTACCAATTTTCTTCAATGCGGATATACTAACATCATGTTATAGCCTCCATGCAGAGTTTAAGATGAACATTTTTGGACTGCAAGCCCATATATTTTGTTTAGCCGACTTTTTAAAGAATAAATTGAAAAACACGAAAGATTGACGTTGAGATTCGAATCGAGATGCATGATTACTTAAAACCAGCTAAGTTTCATAAAAACTAGACCGATTAATATCCTCTGAAAACCGCAACCAAATACTTGTTCGCTTGTTCTCATGGACGACACTACCTCCATGGTAAAACCTTAATAGAGTCTTGATGTAATAATTATTAGCAACAACCATCATAACTAAGACTATCTACATTGGTTACATGATGAATCAAATCTATAAGAATGACATTTGTGAGTATTTCGTTTCATTTTTTAAAGTGTAATTATCACTATCACTAATTTTGGTTTGGATAAATGATAGATCATAAATCTACTATTCTAAGTAAAATCTAAAATGGATTATTGGTATATGTAGATTTTAAATATTTTATTGGTTTATTGATTCTTAAATTCCATCCAAACTTCATTATTGTTGGTTCAAGCTTTTTTATATATTTTTATTCATATATTTTGTTATTATTGATATTCTAATTTTTTTTAAACCTATTGTTGTTACAATTCTCTGTATTTTGGCTCTCTAGTTATAATTGATATAAAATAACTTTAAATACTTAAAAATACAAATCTAGAATAAGAATGGAGAAATAAATGTTATTTATATCAATGAGAGAAGAGAAGAATGCACAAATAAAGAACATTGATATGTTCTTTTATCCACGTGAGAAAAAAAGAATTCATTTTGGAGTTAAAACATTTCCATCAATACATGATTTACTTTGAAAATAAAATGTTAGGAAATGGTTGATAAAATTCCATATAAACTCACTAGAAATCATCGGTAATAATATATAAGAAAAAATTATAAATTGTACACAATCAACTTACCAATAAGTACCATACTGTGAATTTGTGAAGATATTTGATCCTTTACAAGAATCTTGCTGACGTACAAAACGAACGATTAAATATAAGAGATAAACCAAACAATAAATTATATAAGAGGATAATTTTTATAATATTTAAATAATCTCTCCTATGCAGTTTCAGCTTAATCGCGTTGTAATCTCAGCTTAACTAGTATCTTACACTTGAAGATCAACAAAGACAAACCTGCAAGATGGAAATAATCCCTTGTTAAAGTGATGAACATATCAATATCCGCAACAACATCACCTTGAAGCACATTGCATATCGAGCTACAAACAAGAGTTTGGTCTAGGTGAGGATTTTCATCATCCAGATGAATCTTTAAAAAGAGGTTCTTTATACTCGACTTGATTTTCCGATTAAACAAACACTTCACAAAATCAATGAATTCCTTGATACTATCATGTTATTGTATAGCATAATCAAGGTTAAAACGCCGAAAAAGAACAAACACATTCTTTCACTTTCTGGAGAATACTGTCGTTGAAACAGTTTTTTTGTGGAAAGAAAAGATAAAATGTATGCAAAAACATCGTCTTGTAAAAAAAATCTTTTAAAATTTAAAATTTTCTAAATCGTACATAATCAACTTACAAACTTGTGAAAAAATTTGGTAATATATAACTTGTTTGTGAATATATTTGATCAAATACTCTAAAAAGTACTAATAAGTTTAAAAAAATCTTGCCGACAAACAAAACGAACAAACATAAGGGATAAAACAAACAATGAATTATGTAAGAAGATAATGTTTTTTAGTGCAGTTTCAGTCAATCAAAGAAAATCAAAATTTCTAAGTATATATTAGTTTGGGCTGGGCCGTCAACAATTGGTCAGTCACTGAAACGAATTTGTTCGGGCCTTGGGCTTGATCCGTCAACAACATCAAGGTTCAGAACAAATGATTGGTCAGTCACTAAAACGAATATCACAGCTGCCGTGAGATTAGTATACAGTCTATCTCTCTCTCGAAGAAATCGTCACACTCCTATAAATGGTCACTTGTTTCGTACGGCCTTTCTTTACTCCTTTAGAGAGAGCGTGCCATTTTTATTTTTCTCTTTCTTCTCTCATTTTTATTTTCTTTTCTTTTTTTTCACCTTTTTTTTTTCCTTTTTTTTTCTTTCTTCTTCTTCTTACTTGATTTTGAACCCTAGCTTAAGGGGAATTTTCTCGGGAAACAAAAGAGATATTTTTATCGCAGTGAGAAAGAAACACAAAAA,TAAACCCTCTTCACTGGCTCTGAGATACCTTTTTCTGTTTCTTTCTTTTTCTTCTTCTTAATTTTATAACTTTCTTGCTTTTTCTAGACCTTCCTTGTTCAAGAGTCTTTATGTATGTGTCTCTTTCATTTAAAGCCGTTGGTTTTATTTATGTATGCAGAGCTTTATGCTCAGTTTGTAACCTATAGGTCTTACTTGGATTGTAAGCCAAGCAATAAGACAACATCAAATAAAAGGGGATTTGGTTTTCTGGGGTTAATGTTGTTTGTGGTTCTGTAATGATAGGTTTGAAACAAAGTAATTTGTCTTTTATAAAAGTTTTATAGTTTCATTTCTCATGTTAGTACTTTATTTTGTCGGAAATCCAGTTTAACTAAGCATCAAGTGTTCTGTCCACGAGTGTCCTTTGCCATGCA
AT1G54390,0.217939042,545.587824,0.352891111,0,0,0,0,1,N,AT1G54390.2,ING2 encodes a member of the Inhibitor of Growth family of nuclear-localized PhD domain containing homeodomain proteins. Binds to H3K4 di or trimethylated DNA.,protein_coding,INHIBITOR OF GROWTH 2 (ING2),INHIBITOR OF GROWTH 2 (ING2),GGTGATTGTGATGATGACCCATCTAATTGCTTCTATTTATATAATTTGTTCTGTGCATGCAGTTTCTTCTTGGATCTCCTATGTACTGAATGATTCGTTTATTACCCTTAAAGATTTGCTTTAAAAATTAATTTATTTCACTCTTTCGAGTTTATATAGTTTGTTGTATCTTGTGAAATTGGTGTTTCATCACATGCACATATCTTCGTCTATGTGGTTCCAAATATTCTTTTGTTCTTTTTATTTTACCATGCATTGCTTTATTACTTACACATAATGACAATTTTGCTGGTCATTGATTAGAACATCGTTTTAATATCGAATGGGATGTCGAGTTGAATATTTTGACAACGTTCGTTGGCTGGGTCATGAATGAAGTCAGAATACCATTTCTTTTTCATTAAACAATGCTATTTTTTTCCCGCAAAACAATGCTATTGGGCTCATTTTGGGCTTAAAATGTTTTGCGTAATCTCAATGTTTGTGGGGCTTTTAGTTTTTAGCCCATGTATGGTTTGATAACTTTAGTAACTCGTGAGAAAAAAAAAAGCTTCGTTCTCAATCCCAATTCGAAATCCTAGCTGAAGTCTATGCTCCATAATCAAATCCAGTTCATCAGAGATCAAAG,GCTCTCCTCCTGCAATTTCCATGCATTCTGTAGCTAATATAATACGTATGGAGATTTGCACGTACTTATGATATTAATTCTCATAGGTGCCACTGGCATCTTCTTTGGCACCTTCCCTTCATGACCAATGCCACCAAACTCATCTTTCTTGTTACCCAACATCTAGCAAGTGCAAGTAGAAGCAAACTTTAGATGGAGAAATCATCATGTTTTGTAAACCTCGGGTTAATTCGTGGAGCATATATTTTGTATATCAATTGTATTTGGGTATTGGTGGGCATTTTCCGTTTTATTCTACTAGTATCGATATTTACATCTGCTTCTTTCTTTCTTTTTTCCCCTCAAACCATGAGCCTTTGTATTGATCAAATGACATGTACAAAGGTTTTGTTCATCAGAAGGAATTTCACTAAAATAAAAAATTGCTTGATATTTTATTCTTGCTGTTTATATATGAAAAAAGAGAATCCATTGTGAGCAGCTGGTTTGATGTGTCTAGATCGATAGAGGGTGTACATATATCAGTGCTAGATAAGTTAGTTACTCCCTTAGTTTGAGAAGTACTACTTGTTTTGACTCTATTAAGGAATACTGATATTATTGTAGTTTAGAGAGGAGAGATGCTTCACAGAACAGACCCACTTCTGCTTCAGAGGCAATGCTGTGTTTGGGACTAGTAAACTAAACTTCTACAAGGCCAAATCGATTCCTAAACATATGTCAAAATGGATCCATTAGATTAGTCCTTTTTAGCCTTAAAACCATTAGTACAGTATAAAATTTGTGGTCGATCTGTAATCATCCTCTTAGTATAATAATCTCAAACTCAAATATAATAACACCACAGTAGCATTTATTTGTTCACGGATATTCACACACCGTCTCAACTAAAATAATTTGAAAATGCAGATCACTAGATCTAGAGACTTGAGAATGGGACCCAATGCAACAATATAGAGCGGTGAGATTTCGAATAGAGAGATTTGAATTTAAAAATCTCCGATCTATTTTTTGTTAAACACGAGAAAATATAATTATTTAATAAATAAAAAAAGACAAAA
AT1G60670,0.243686444,345.2249884,0.291583605,0,1,0,0,0,N,AT1G60670.2,hypothetical protein (DUF3755);(source:Araport11),protein_coding,,,TGATGTCTCATTTTTGTCTATGCACAAATTCAACTTGATTATTTAGGTATATAAGTAAATAAAAGATTTATCATAAAATTACACATGTAAAAGTTTGAAACAAATTTAATTATTCATAACTCACATAAGACATGTAAAAAAAAACAAAAAAAACAAATGTCACTTAGTGAAATGGATACCAAACTTTATGATTTATAATACCTTGTTGTAATTTAAATATCTGAATTTCCAAAGTGTAGGTGACTGTGTAATTCACAAAAATTGAGTAAAAGTTTAAAAAAATAAGGAGGAACAAACCATCTTTCTTCAAAGAGTGGACTAGACAAAAACAAAAAAGCAAAACCACCACAATGGAATAAAAAGTGGTTCTGTTTCTTAATAGAATAAAAACCATTACAAAACAAAACCACCATTTTCTCTCTCTCTCTCCTCGCCAGCTTCTGCAATTCGAAAGTTCTTCGCATCATCTTGCTGTCACCACTCTCTCGCGAATCGAATCACGATTCTTCAATCTTCTTCTTCTCTATTGCGATCTCTCTGAATTTTGTAGCTTCACGATTTCAGTATCTCTACTTTCATCACCAATCGTTGGGGGTTTAGGGTTTTTGCATCGACGCCATCTATCGAGCTACGGAGAAGCATACTCATCTTCTATTTTGGCTAAATCCGAGGTGGGTTTTGCTCAGGTTTTGCTCTTTTAGGTTTCTGTTGGGTTTTAATCGGATTTTTTTCCGTATGATTCTGAAATTGCTAAAACCCTAAATTGAACATGTTTTTGGGCGTGCTTCGTTGTAGGTCAACTTAATCTCTACGAAATAGCTTTTGAGTG,CAATGATCTTGCAAGCAGTTTAGTGACAAGTGCCACACAGGTAAGCAATCTTGCATTTTCTCTGAACGTGGATATTCCTGAATATGTAAGGGATTAAAAACCTCAAATGCTTCCCTTACCAAATTTGCCTCTGTTTCATGAAAAAATGTCTAATCGCTTCAAATCATAGGACTTCCATAACCCCTAAAAATCGGCTTCTAGTATTTTAGGGAACTATGATCTTGTACAAGAACATTGCTTTAAATCTGGTGAATGATGGAAACACAATGTTTGATGGTAAAATATAATTTTTTATCTGTCTGTCTCTCAGCCGAGATCTTATACCATTCCCTCGAGCATCTATCTGAAGCAGGAGCCAAGAAACTGATGGGGGAGGAAACTGGATTTTGACCAATGCTAAAGGAACTAGCACAAGAAACCTCTGGTAAATGGCAGCTGTTCACCGTGACCCACATGAAAGATGATGGTTTTGTCAACTGCTAAACCTCTTGCAAAACACAGGATTGAAGAAGATGGGATCTTGTGGAACCCTTTGTGCTGTCGGCTAATATTAACAATGAACCGCAGGCTAGCCAAAAACCCCTTTTACAAATCCTTTCACGTCTCCATAACTGATTATTTTTCCGTTGCCAAAATGCTTTGGCGGTCAATCCAAGATATGAATTCGTTGCACAGATCCATGTTAAAAGTTGGTTGTATAGATTAGCTGTTTCTGTAAGGTTTTAAATGAGAGTTACTTTAAAGTTTGTATCAAGAACACATCTTTGTAAGGTTTGGTTTTCAGAGGCATTTTCATTCTTCAAATCTTATCTTCAAATCAGCTACCATATGGTATGGCTCCTCTTTT
AT1G64550,0.230890152,1595.881204,0.297679588,0,1,0,0,0,Y,AT1G64550.1,"Encodes a member of GCN subfamily. Predicted to be involved in stress-associated protein translation control. The mutant is affected in MAMP ((microbe-associated molecular patterns)-induced stomatal closure, but not other MAMP-induced responses in the leaves. Arabidopsis has five ABCF proteins, which are all closely related by sequence to yeast GCN20. None of these five are individually required for GCN2 kinase activity.",protein_coding,ATP-BINDING CASSETTE F3 (ABCF3),"ATGCN3, GCN3, ABCF3, ATGCN20, SCORD5, GCN20, ATABCF3",TTGGCGAAACAATTAAGAGGTCTAGTTTTGGTAAAATCCAAATTGCTAATCTATCATCTCTCAAACATGTGTTAACAAAAACAAAATTGAGGACTTTTGATTTCACAATGGCCTTGAGCCATGTTAAGAGGGAACAACGTTAACCGGATTAAATCATAATATTTGGTTTGGTTTAGTAAATTAGAAAACGTACTGTATACTCTCTCTGCCTGAGGGAGAAGGTTCCAAATAGCCCTAAAAAGCTTCGCCTTCTCTCCTTGCCTTCATTTCGGGTGTGGAGGAAAGTTATCAAATCAGTTTTTGTGGAATTTTGAATCTCGTCGCTTCTGTGTTGGCT,GCTGCGCCGCATTTCTTGTATTCCCCAAATCCATGTTGCGTTTTTGTTTACCCTCAATACGACACAAGAGTCCTTTATACCTGAGAATTTGGCGACAGTATTTTGCTTTATGTATTAAGGTTGAAACTAAAAAGAAATACTGTAAAATCATACACTTGGTGGAGCACGAAAGGATTCATATCCAATGTGAATCATCCGTAAAATTGTAAACGAGCCAAATTAGAATAAAAGAGCATGTTTCGCAGAAATTTATGGCAACTAAAATTCATTGTACAGGTACAGGAATAGCAAAAAAAGAACATGTAGGCCCAAAGACAAGATTACAAGTTGTGTTTTTTTTTTCCCACATATGTTTAACCGAAAGAAAAACCCAAATCTTCGAATCGAGCACCGTCGAACCATTACCGAGGAGGAATATCATTCCACAAATCGATATCCTTAAGAACCTCTGCTTGTGGATTCGATTGTTCAGAAGAACTACAAGACTCTTCAGGCCGTACTAGCGTCGTTGCAAAACAATGGAGATGCTGCTGCTTTAAACAACTCCGCCATAGATCTTGGTGCAGAGCGTGGGAATGGAAGATGATGACGACAACAAAATGGATGACGATGATATAGAGATGGATGGGGGTGAAGGAGAAAGTTATAGATGTGTTGAAGGAATGTGGTT
AT1G64990,0.214650795,824.995576,0.538036833,0,0,0,0,1,N,AT1G64990.1,"Encodes a GPCR-type G protein receptor with nine predicted transmembrane domains. The protein binds abscisic acid (ABA) and is predicted to function as an ABA receptor. It has GTP-binding and GTPase activity and binds to ABA more effectively in the presence of GDP. GTG1 binds to GPA1, the alpha subunit of the heterotrimeric G protein. GPA1 (in its GTP-bound state) affects the GTP binding and GTPase activity of GTG1 and may act to down-regulate GTG1 binding to ABA. GTG1 is widely expressed throughout the plant and appears to be involved in the regulation of several ABA-dependent responses including seed germination, plant development, and promotion of stomatal closure. GTG1 transcript levels do not appear to change in response to ABA or abiotic stresses.",protein_coding,GPCR-TYPE G PROTEIN 1 (GTG1),GPCR-TYPE G PROTEIN 1 (GTG1),AAATGTAGGATTGAAAAGCATAAAAACATTATAAACAAAATAGCTCAAAACTTTTTTTTGTTAAATAATTGTGATATAATAAGAAAAACGTTTTGTAGTTTTTTTAATTTTGAATTATTTTTTCCACATGCATCAAATATAACATACACATGAAAATCAAATATAAATGTATGATAAATATTGTGAATGGTAAAAATAATAGAATCACGTTATGAAAAATGGTATATTATACATCATCGATTGGTGTCTGATAAGTTTGGAGGAAACTTTAGCAATAATACAGGTTTTCTCTATTTATTCATTAGCTAATAGGATTATTTATACAAAAATCATAACTTGATTAGCAAGTTCTTTACATTTATGATAATATTAAATTTTCTATCTAACAATAAGAAAATGTACACAAATATTAATTTTTTATTAATGATAAAAAAAATATTTATCTTGATCCCGTAATTATAAGATTTATCATGAACTATCGATATCCCGATCTTTCCCTTCCCACTTCCCGCAAATTTATATATGGTAACACGTGTAAGATTGGACAAGCCTTCTAAACAACAATTTTAATGAATCGATCATTTTTCGTGTATATATGTAAAAGTGAAAGAAAAACAAAAAAATCAATCGACCAGATAAGAAAACATGTCGGAAAATGGAGTTAAAATTATCATCAACACTAGACTAGACGCCAAAACCTATAAACAAAAAAAAAGGATAGAAACACTATTGTTGTGCAGTTTCTTTCACATTACTCCGTAGCTCAATGGTTGGTTAGCGTTTAATAACGCCTTCCTCTCTGCGAGTTCGAGTTGAGTCGCATGGTGGTGGTGGTGATGATGAAGTTGATGAGGTTGTTGTTGATTAGAGTTTAAACCAAATAAACCCTAACCAAAAATAAATAAGGTATTCTTAAATACTTTTTTTTTAATTGTTTCATAAATGATCAAATTCGAATCGAATCGTACAACAGAAGCTCTGGTGTTGAATCGCCATGAGGTTTTTGCAGATCTGAGGTTTTTTCTCGAGAAGTAAGAGAGATCTGGAATTTGGCGACG,GTTTCTTATTCAATAATGGTGCCTGAGAGAGTCTTATGATTGTTTGGCCTGACACAACGAAAATCAATTTACTACTAGTAAAGGTGACTTAGTGTATAGCTTACAATTGGCTATTTGTTTGTTTTTGACGCTTATGTGAAAGATTAAACTGATCAGTTCAAAATTTCTTATACCATAAACGTTGAATTATGTTTATTTGTACATTGCTCCTACTGAGGAAGTAATGATACGATGAAGTCAAGAAGATTTTCGATATTTGTATGTTCGACTTATTCCACAGGATCCAGGTTTCTCCATTTGTTATTTATTAACATATACAAATTGTATTATAAAATGCGTTGCGTGAGTAACCTTAGTAAATAAGTAATAACACATTCAGTATTGGATGCTCGTAAAACAATTTTGAGTAGTAGAAAGTCTAACGATTTTGTTAGATTGAAACTGCAAGACTAGGGAGCTAAGAATATGAATATCTCAATCCCACCAAATGTAATAAAATGTTGAATGAATCATAAACCTCTAGAGTAGGGTCTGGTGGTCTGATTCAGTTAATCAATCCATATTACAAGTCGATGTGGAAACGACCAATCATTTAGACTAAAGAGTCTGTAAATTTTTCAATATATTTCTAACCATGCAAACTTTAGACTAAACTAAAAAAGAGTCATATACTTATTAATGCATGGAACAAAGAAAAAAAGTAAAAAAATAAAAATAACGAAGAAAAAAGATTAAAAAAAAAACAGAGCGTGTAGTGGAGGCCCGAGCACATGGGAAGAGAAAGAAGCAACGCATAAAGCTCACGCCGACGCCGAGTCAACACGTGAGTCAACTCGAGCCTCTGTTTTTATAATTA
AT1G71860,0.243062937,1059.689715,0.39184186,0,1,0,0,0,N,AT1G71860.1,Encodes a protein with tyrosine phosphatase activity that is downregulated in response to cold and upregulated in response to salt stress.,protein_coding,PROTEIN TYROSINE PHOSPHATASE 1 (PTP1),"ATPTP1, PTP1",GTGTGTCACTCGAGACTCGGAAGTGAAGAGTTTTTATTATTGGTTATGGGCTTTTAAGTTGGGCGTTTTAGGCCCACTGTAGTTTTTTCTGTGACGTTGCCCATCTTTTTTTTTATAATGATGAGCCCATCTAAAATGTTATTCTACAAAACAATAAAAGAAAGACCAGGATTCCTTTGCTTAAAAGACCAGGGTCCTTTGCTAAAACTATATTATAATGACCAATGAAATCATAATTAATAATGACCAATTAAAATGATGACAAAAAAAAAAAAAACCCAATTAAAATAGTAAATTTATATTATAGTCATCAACTTTAATACTTTGTTGCAAAATAAAAGGAAACAGTCGCATAATAATCCACTAATCACAAACCTTTACCCTTTCTTCTCGGGGCCAATCAAAAACTTCAATTAACCAGAAAAGGTCAGATTCTCCGCCGCCTCACACGACGGGCAACTTCAGTTCCTGCCGTCGCGTTAGATCCCGCCGTCAATCGGTC,AGGTACGCAATTTCAACAATCAAATCTGAGTGAGCCATACCTGTTATAATCTATGAATACTCTTATCTTGTCTATCTTTTGATCCAGCTGAAGGGTTCGTCTGCTTAGAGAGGGAAAAAGGCTTCTACCCAACTATATCAATTTCGTAATGTGATTCAAGAAGAAACCCGCGTGAATCTCTACATTCAAGACTTTTCAATTTCTGTAAATTTCCATATCTGATAGGTTTCATTGTTACTTTTGTTGTGGAAATGCTGATTAAAAAGCAAATGAAGTCGCCAATGCGAGATTCTTCAAAGACTATGAATTCGGTTTGATTTGGTTTGAAGTGTAAAAGAACCGAAGATTAATTTAATGGTTTAGACTTAACCGAGTTTCTTTCGAAAATAAATAAATCAGAAGCGGTTAAAATTGGCGTAAAATGTCCCGAGTCATCGTT
AT1G71900,0.252404054,612.8375324,0.369023782,0,1,0,0,0,N,AT1G71900.2,"magnesium transporter, putative (DUF803);(source:Araport11)",protein_coding,(ENOR3L4),(ENOR3L4),CAATTTTTTTACTGTTTTTTTTGCTTCGGTGAAAGAAAGATCCAACTAGAGAAAATAATCCCAAAACAAAAAATCAACATTCAAAATCTGAGCTCTTTTCTAAAATTAAATTCAAAACATGAACTTATTCTATGTAATTTTTTTTTTTTGTTTTAAAGACATGGCCAATGGGCCTTTCACTCTTGTCAAACCCATTTGAGTCGGGCTTTAGTCATAACTCATTTTAAAGATTAAGGAATATGAGGCCAGTTCTTTTGTCACAATCCTAGTTTAAGCTTGTCTCACTTACCAATTACGTCTCTCAAAAGACAAATTTTAAAAAATCTATAATCTCTACTCTCTAACATGTATATATATATGATAAACTCGTTGGCTATTACAACTTTTAAATCACAAATGGCCTGATTGGAAAAAAATGTATACATAAATGATAAGTTTGTCACTGATTAATGCGAGAAAATTCTAATTATTTGCATTAATAAAATTAGCGTAGTTAGGTTTTAAAAAGGTTTATACAATACATTATACATATTTATAAATTTAAATGTTTTTAAATTTATATTAAATTTATTTTATTATTTAGATAAATCTTAAATAAAAAGAAACCAAATATTATTTGTTATTTTTTCGTGAAATTTATCTTTTTAATATATTTTTTATTTTAGTAAAAAGAAGGAATGGTGGCGCCGGAAACTGACCGTAGGGTCAGTCTAATTACTCTCTCAGCGTTTCTCTTTTTGGTCCTCAAATCTTCACCTTCAAGATCTTCTTCGTCCCTCGATCTCCGATTTCAAATCTCGTTTCTCCGTTCAAGCAACCTCTCTGAATTCCTAGTCTCACAGCAGGAATTAGTACTCGGCGAAGCGATTTCTGCTTCGATCTCTACATCTGAAGTTCCGATCTGACGAAATTTAGGGTTCGTCTGGGTCGAAGTTAAATAGGAAAAAGATTTCGAATTGGCTTGAGA,AAGCTTTTTCGCTCTGTTTTCTGGTCCACTGCGATAACTGCAAACCAGAGAATCAACCTTTTTTCCTTATCTCGACTTATTATGAACATGGACCATGGTTCTGTCTAACACTTACAAATGGTTCAAGAAGATCGAAGAAGGAAAGAGGAGCAGCGAGGATGAGATCATCTTCTCCAATATCGGTAAATATGCTGTGAGTTCAAGCACACGCCATTAGCACACACCCACGCCTAAACCCTTGGTGTGACAGTTAAAATTTTATAAACAAGAGATGGGTTTTGCCTAAATTGGTCTTACAAGCATCTATAACTAAAGGTTTCAATTCAAGATTTGCATTATTTTTTATTGAATCTTCTATTTTTCTTCCTTAGTTGGTTTGAAGCTTTAAACCCTTTGAAAAACAAGAAATGGAGACTTTGAAAGTTGACGAAACACACATGTTTTATTATTAGTCAATAGTAATTTGATGAGGTGGAGTTATAACATTGATGATAATAGATAGTGACAACGTTCTATGTTCATCTTTTCCTCAATCAATCACTCCACCGGTAGATGAGATGTCAAATTGAAACTGCGTTATGTCACTCTCATTACTCTTTTTGTATACGTTTCTCATCTTATAGCTAATCCGAAACCAATTTATTTAAAACTTTATAATAGCATAAAACCTCTTAACTTCAAACAAGTTTCAACTTTCACATATCTTATAGGGATCATGGTAAAAATGGTTAAAAGTTAAACCTGATTTGCATTACAAACAGAGGATTACGTGTATAAGGGCTATAAACTATATATTACCTAAAAAAGAAAACTAGAGTTGACTTATTGAGTAATAAAATCGCCTATAAATATCGTAACGAAAGAAAAAAGATCCCAA
AT2G16880,0.251566614,466.049506,0.346557938,0,1,0,0,0,N,AT2G16880.1,Pentatricopeptide repeat (PPR) superfamily protein;(source:Araport11),protein_coding,,,TTTAAATAAATATTTTAATACATACGTGTACAGTTTATTTTCATCGACACAAGTTAAGCTAAAACTCGAGTTTGAAAACCAAACTGAGGGAACCATTATTTCTAATTATACAAGTATGTGTCAAACATTAATCAGCTACAAGACAGGATAAATTCGGAAACGAATAGTGTCATCTTTAATGTTAAACAGAAAAAAAAAAATATACATAAAATTCATATTAAGTTACAAGTATATTGGTTGAGTGGAGTTGTCATAACATTAATATTAAGAAAGAACAGTGTCATCTGATAATACTTTATCTGTATATGTAAGTTCAACTGATTCTAGTTTACGTACGAACTTAGTTATCGAGTTGAATTTAGGTAGAGAGTGGAGACACATCGATGATGATAGCAAAAACCATTACACTAGGGTAAATAAAAGTTTAATATTACGTATACATATAGGGTAATAATAGACATCATAAGGTATGTGGGATATTTTGTGACTTAAATTAAATTATATTTGTGACAAAAAAAATTTTTATCTAAAGATTAACATTTTAAAATACTCATTTGTTACATATCAGTGAAATCACCTTCAAATCAAATTTCAAATCAAAAAGAAGAAGAAGAAGAAAGTGATAATCCAAAGCTGACACTTCGAGTAATTTCCCATATATTAATAATGATTAATGCTTATAGCCTTATGTATCAATATCACTCATGCATGCGTAAGTTTAAACGTAAAACCTAGATGAAAAGAAGAAAAAGAATCACAAAGATTTGGGCAAGACAGGTGTTACGTATAACTTTCTCACGGAAGCAAGCAATGTCCCAGAAGTTTCTTCTAGAAACCAATACTCTAGAAAGACTATATATCAAATAAACAAATACAAAAATTGACGAAGAGGAAAAATATATTAAAAGATGATAATTTGGATACACTATATTCATATTTTCACTGAATAAATATACGTATATATACGCTATTTGTTCACTTAAAGTATAGTTGTAAAGAACTATGATCTTCAAACTCTAAGTAGTATCATAAATCTTTTTTTTTTTTTTCTTTTATTATTATGACTTTATAGAAAGGACACTATGATGATGCAATTGACATGGACAAAAGTCACTACGACGGTCTATCGTTTCGCCCCACTTTTGCATTAGAGCCAAGTACTAGCCACAGCCTCTTGCAGTGACAATGTCGCGTTCTAGGCAATGTCTCGCCGTTCGTTTTTCTTTCTTAGTTTTATATTTTGAAAATTTTGTTTCTTGTCCTTTTCACTTTTAGTCTTTAGACTTACTTTTTTGCACTACATCAACACCTATCTACAAGATATTTCTGTAGATACGTATATACACTTACTTCTTTTTCTAGAAGCTCATTTTATAACTTATATAACATATAAAGTATCCTAGCTTCATGTCATGTTGGCTCGTTTCGTTGTCGTCGACATAGAATATATAATGCTCCTTCAATACTTAGATTTAGATGTTGCTGAATAATTGAATAGCAAATGCTTATATCTAATGTAAATATTAGTTTATCACTGACCAAACTTATAATCTAGTGGTTAATACAACTTTGAATTAAGTGCTTTTGTATTCGTGCTGCTATCGTATCATCATCGAATTTAGTGCTATTGTACTAGAGTTCGTGTTTGTGAATTAGTGATAAAATATAATTTTACTAACTTATAGCTTAACATTTCTTAAACGTTATATTGTAATTAGGGATGAAAACACAAATGCAACAGTTAGTTTTTTTATTGGAATATAATCACTACATTTATCAACATTTCAATTTCGCAAAAGATATTTTCTAACTTGTAAATAAGTAAATTATTTTTTTCTATTTGTCTGTAGCTACGCAAAATAAGGTTTTGGAGAAATATGAATGTCATACAGTAAACCTAAGAATAAACAATAATAATTAAAACAAATAAATTTATTTTAATTTAAAAAGAAATCTGTTTTACTTTACTGATCCAATTTTTTTAAAATATAAATTATAAGAAAAATAATCATGCGAAAATTCGTATGTACTATGTAGCATGACCAAAACATTTGAGAATGAAATGATTTTTACCAATGAAAAAAAAAAAAATCATGAAACGACAGGGTCCTATTGCGTTTGGTTTAAGCCGAAAACCCGAGTTCTCCAATTTCCGGTTCGGTGTAATCCCGGTTAAATATACGCTTCACAGTTTTAAACCATCACAGTGAAAAAGCTTCATAGCTTTCTTCTTCTTCTTCTTGACGATACAACGAGGATGATCATCAGATAAATTTCCATTGATTGCCAACAAAA,AGGAGAAACTCCTTTTTTGTGGTTTCTTTTTTGTATTTCGATTTTCTCAAAGCATACTTATTACTTGTTACAGAAAGACATTGTAATGTAGTTTTTATGTGATGATGATGATTATTATGTTTAGATTGATTAAAAAATTGTGTATTAACATATCAGGAAACTTTCAAAATGTCGTGTACTCGTACGTATAATATTTTACTGACAACAAAAGAGAGAAAAAAACGATCTGAATTCCTTTTTTGTAATCGGTGACCGGTTCGGAAGGCTGGACCGATCGGGTTACCGAATTTTTTTTATAATTTTGGTGAATTGTTTCCATTTTTGGGTTTAAAACCGAGCCTAACCGTGACAAATTCTCCAAAAACTACCGAAATATATCAAAACTACCAAACATAAACCGAAATTACCCACATAAACCGATATTGTTTTTTAAACCGAACTTGGGTTCCAATTGAGAATTATTT